VendorID2,Prefix,Middle,Suffix,Firstname,Lastname,Mailname,Address1,Address2,Address3,City,State,Zip,Carrier_rt,Salutation,Employer,Occupation,Organization,WorkPhone,WorkExtension,FaxPhone,Email,HomePhone,contrib_Date,contrib_Amount,sAccount,sSource,UNI
2294599,Ms.,,,Ruth,Haigh,,8651 Foothill Blvd   # 94,,,Rancho Cucamonga,CA,91730,,,retired,retired,,,,,RUTHHAIGH@VERIZON.NET,909-949-2507,4/1/2007,$35.00,135,208,0
886148,Mr.,,,Aaron,Reid,,3005 S. Leisure World Blvd.,Apt. 516,,Silver Spring,MD,20906,,,Retired,Retired,,,,,THEREIDS999@AOL.COM,,4/13/2007,$50.00,135,208,0
16962,Ms.,,,Adele,Goodell,,145 Hickory Hill Rd.,,,Berlin,CT,060371265,,,Retired,Retired,,,,,dogpatch@sover.net,,4/21/2007,$35.00,135,208,0
3139894,,,,Adrienne,Okin,,2157 Haeger Ave.,,,Arcata,CA,95521,,,,,,,,,adrienneokin@suddenlink.net,,4/4/2007,$50.00,135,208,0
3131853,Mrs.,,,Aimee,Postell,,"1005 Isabella, No. 32",,,Houston,TX,77004,,,Satterfield & Pontikes,Marketing Coordinator,,,,,pgtbeau2001@yahoo.com,,4/29/2007,$35.00,135,208,0
3035580,Mr.,,,Alan,Ziegler,,10625 N. Camino de Oeste,,,Tucson,AZ,857429120,,,University of Arizona,Computer Analyst,,,,,aziegler@u.arizona.edu,520-331-5985,4/1/2007,$25.00,135,208,0
2118504,Mr.,,,Alan,Reder,,16 Homeplace,,,Topsham,ME,04086,,,Mzaine Courier Service,Executive,,,,,ALMECOURIER@MSN.COM,207-729-0053,4/3/2007,$25.00,135,208,0
3109806,,,,Alan,Muirhead,,3029 Old Creek Rd,,,Middleton,WI,53562,,,retired,retired,,,,,amuirhead@charter.net,,4/7/2007,$100.00,135,208,0
3109619,,,,Albert,Tyson,,1216 Zena Lona St. NE,,,Albuquerque,NM,87112,,,Mori Associates (contract with Fed Aviation Admin),Systems Engineer,,,,,aljommm@msn.com,505-296-0180,4/3/2007,$100.00,135,208,0
3098940,Mr.,,,Albert,Grinton,,1591 W Acala St.,,,Green Valley,AZ,85614,,,retired,retired,,,,,AGRINTON@AOL.COM,,4/1/2007,$25.00,135,208,0
1033054,,,,Albert,Macovski,,620 Sand Hill Road,Apt 407B,,Palo Alto,CA,94304,,,Stanford U,Professor,,,,,macovski@stanford.edu,650-473-9163,4/16/2007,$200.00,135,208,0
7659,Mr.,,,Albert,Grand,,933 Lawrence Court,,,North Bellmore,NY,11710,,,retired,retired,,,,,savoyid@optonline.net,,4/4/2007,$35.00,135,208,0
49249,Mr.,,,Alexander,Warren,,8 Maple Street,,,Newburyport,MA,01950,,,retired,retired,,,,,zwarren@aol.com,,4/4/2007,$100.00,135,208,0
15336,,,,Andrew,Tsao,,2610 110th Ave NE,,,Bellevue,WA,98004,,,University of Washington,Professor of Dramatic Arts,,,,,andrtsao@mac.com,425-739-0855,4/28/2007,$100.00,135,208,0
2960900,,,,Andrew,Kincaid,,5275 Paoli Way,,,Long Beach,CA,90803,,,LBAHC,low-income housing developer,,,,,akhainc@aol.com,,4/10/2007,$25.00,135,208,0
3130303,Ms.,,,Ann,Sheppard,,1003 W. Olive Ave,,,Redlands,CA,923735020,,,redlands unified school district,teacher,,,,,nna2@verizon.net,909-793-9222,4/23/2007,$25.00,135,208,0
3129877,,,,Anna,Evenson,,2500 NW Ivy Street,,,Camas,WA,98607,,,none,none,,,,,anna_evenson@msn.com,360-833-9962,4/22/2007,$10.00,135,208,0
50044,,,,Anne,Randolph,,15 Hill Point Ave,,,San Francisco,CA,941173603,,,Onset Pharmaceutical Consultants,consultant,,,,,anne.randolph@gmail.com,,4/1/2007,$100.00,135,208,0
1528651,,,,Anne,Lindsay,,8180 Sherman Rd.,,,Chesterland,OH,44026,,,retired,retired,,,,,annewlindsay@worldnet.att.net,,4/27/2007,$25.00,135,208,0
3130787,Dr.,,,Anne,Cahn,,2032 43rd  Ave. East,Apt. 18,,Seattle,WA,98112,,,retired,retired,,,,,annehcahn@aol.com,206-729-4979,4/25/2007,$50.00,135,208,0
3125586,Dr.,,,Aris,Papayoanou,,19542 Sierra Raton Rd.,,,Irvine,CA,92603,,,N/A,Physicist (Retired),,,,,apapayoanou@sbcglobal.net,,4/19/2007,$100.00,135,208,0
2950924,,,,Arnold,Stein,,2368 Oak Hill Rd.,,,Lake Barrington,IL,60010,,,N/A,Retired,,,,,ARNIESTEIN99@COMCAST.NET,847-381-7791,4/11/2007,$25.00,135,208,0
2072620,Mr.,,,Arnold,Rosen,,9 Vancouver Drive,,,Huntington Station,NY,117463812,,,retired,retired,,,,,rosenarnld@optonline.net,,4/13/2007,$15.00,135,208,0
277418,,,,Art,Wang,,3319 N. Union Ave.,,,Tacoma,WA,984076043,,,WA St. Employment Security Dept.,Attorney,,,,,artnancy@harbornet.com,,4/30/2007,$35.00,135,208,0
3109747,,,,Arthur,Kennedy,,1404 Centennial Blvd,,,Springfield,OR,974773258,,,LANE TRANSIT DISTRICT,Bus Driver,,,,,artkennedy@clearwire.net,541-747-8242,4/5/2007,$25.00,135,208,0
3018894,Mr.,,,Arthur,Brandt,,12252 Mantawauka Drive,,,Fenton,MI,48430,,,"Bates & Carey, LLP",Lawyer,,,,,afbrandt@sbcglobal.net,810-629-4914,4/4/2007,$50.00,135,208,0
1085,,,,Augusta,Levine,,12926 Traviata Drive,,,Houston,TX,77024,,,Heaton Cathcart Levine Ennis PC,CPA,,,,,augusta@hcle.net,,4/26/2007,$100.00,135,208,0
3119211,,,,Azella,Metzger,,67 Leland Drive,,,Novato,CA,94947,,,N/A,Homemaker,,,,,azella94947@verizon.net,415-898-7616,4/12/2007,$35.00,135,208,0
3129637,,,,B J,Scales,,140 NW Dillon,,,Pullman,WA,99163,,,Washington State University,librarian,,,,,skooooo@excite.com,,4/21/2007,$50.00,135,208,0
1144476,Mrs.,,,Barbara,Field,,341 N. Jackson St.,,,Elgin`,IL,60123,,,Retired,Retired,,,,,barfie65@aol.com,847-888-1608,4/9/2007,$50.00,135,208,0
46480,Ms.,,,Barbara,Conlee,,P. O. Box 1206,,,Palm Desert,CA,922611206,,,HPC,Marriage & Family Therapist,,,,,gmbee8@yahoo.com,,4/1/2007,$35.00,135,208,0
113060,Ms.,,,Barbara,Mead,,432 Clubway,,,Hackensack,NJ,07601,,,self employed,consultant,,,,,babs.mead@att.net,,4/3/2007,$25.00,135,208,0
1144476,Mrs.,,,Barbara,Field,,341 N. Jackson St.,,,Elgin,IL,60123,,,Retired,Retired,,,,,barfie65@aol.com,847-888-1608,4/9/2007,$50.00,135,208,0
3131717,Ms.,,,Barbara,Whaley,,7415 Canterfield Rd,,,San Antonio,TX,782403110,,,retired,retired,,,,,bwhaley@satx.rr.com,210-681-2139,4/27/2007,$50.00,135,208,0
1958474,,,,Barry,Mcnamara,,1550 N.Lake Shore Drive,Apt 20 G,,Chicago,IL,60610,,,retired,lawyer,,,,,paddybarry@aol.com,312-944-6111,4/25/2007,$100.00,135,208,0
1539119,,,,Barry,Curran,,PO Box 6391,,,Norco,CA,92860,,,USDOI - BIA,Home Living Assistant,,,,,bcurran08@yahoo.com,,4/1/2007,$25.00,135,208,0
3121586,,,,Ben,Silvert,,11 Cross Hollow Rd,,,Woodbridge,CT,06525,,,self,application support,,,,,bensbridge-dems@yahoo.com,,4/16/2007,$50.00,135,208,0
1686340,Mr.,,,Ben,Manzano,,14 MAPLE ROAD,,,RANDOLPH,MA,023683824,,,NA,RETIRED MILITARY,,,,,bmanz314@aol.com,781-986-6354,4/4/2007,$50.00,135,208,0
3124848,Mrs.,,,Benita,Cranford,,9114 lafayette   court,,,charleston,SC,29406,,,retired,retired,,,,,elcj1@comcast.net,843-824-9751,4/26/2007,$50.00,135,208,0
3124848,Mrs.,,,Benita,Cranford,,9114  lafayette  court,--------------------------------------------------------,,Charleston,SC,29406,,,retired,retired,,,,,elcj1@comcast.net,843-824-9751,4/19/2007,$100.00,135,208,0
3130503,,,,Bernie,Metz,,rd2 279a mccoy rd,,,valley grove,WV,26060,,,Center Valley Federal Credit Union,ceo,,,,,woven@1st.net,304-234-8616,4/24/2007,$250.00,135,208,0
2982377,Ms.,,,Beth,Gifford,,3417 241st Avenue SE,,,Issaquah,WA,98029,,,N/A,Homemaker,,,,,bwgtwo@hotmail.com,,4/1/2007,$100.00,135,208,0
2555210,,,,Beth,Lilienstein,,8319 Snug Hill Lane,,,Potomac,MD,20854,,,ISG Group,"Vice President, Software Development",,,,,BLILIENSTEIN@ISGGROUP.COM,,4/10/2007,$50.00,135,208,0
3130629,,,,Bev,Courtney,,7303 E 85th Terr,,,Kansas City,MO,64138,,,retired,retired,,,,,bevcee@sbcglobal.net,,4/24/2007,$20.00,135,208,0
3029861,,,,Bill,Lavery,,1551 Bishop Road,,,Saline,MI,48176,,,n/a,retired healthcare exec,,,,,blavery447@comcast.net,734-429-7273,4/30/2007,$25.00,135,208,0
2948576,Mr.,,,Bill,Platt,,257 1st Street #3,,,Hoboken,NJ,07030,,,"Bill Platt Films, Ltd.",Filmmaker,,,,,plattfilm@aol.com,,4/4/2007,$15.00,135,208,0
3121466,Mr.,,,Billy,Bottoms,,P.O. BOX 7,103 SHADY ST.,,SUMMERTOWN,TN,38483,,,N/A,disabled,,,,,bjanice1@aol.com,,4/16/2007,$35.00,135,208,0
3118714,,,,Bob,Carey,,7750 San Andres Ave.,,,Atascadero,CA,93422,,,Saes Pure Gas,Quality Assurance Engineere,,,,,bobmargo@sbcglobal.net,,4/12/2007,$35.00,135,208,0
34976,Ms.,,,Bobbie,Ross,,19124 Peninsula Club Dr.,,,Cornelius,NC,28031,,,Retired,Retired,,,,,Brossnc@aol.com,,4/10/2007,$35.00,135,208,0
3130788,,,,Bonnie,Lallier,,PO Box 5133,,,Irvine,CA,92616,,,"Univ. of California, Irvine",Admn. Asst.,,,,,brlallie@uci.edu,,4/25/2007,$25.00,135,208,0
120184,Mrs.,,,Bonnie M,Fletcher,,10406 NE 112th St.,,,Kirkland,WA,980334446,,,Lake Washington School District,Computer Tech,,,,,HOXFAN@COMCAST.NET,425-889-2662,4/28/2007,$15.00,135,208,0
2953264,Mr.,,,Brady,Richmond,,2156 WEST 158TH ST,,,markham,IL,604264169,,,retired,retired,,,,,SKY_BO@SBCGLOBAL.NET,708-596-6993,4/24/2007,$25.00,135,208,0
3113613,Mr.,,,Brandon,Perlow,,1417 amherst ave,apt 8,,los angeles,CA,90025,,,Art Institute of Los Angeles,teacher,,,,,brandon_perlow@yahoo.com,,4/9/2007,$50.00,135,208,0
2532998,Ms.,,,Brenda,Smith,,1411 Tetbury Lane,,,Austin,TX,78748,,,accountatn/writer,self,,,,,brendasg@earthlink.net,,4/21/2007,$25.00,135,208,0
3109655,Dr.,,,Brendan,Teehan,,377 Wyldhaven Road,,,Bryn Mawr,PA,19010,,,retired,retired,,,,,brenmar4@verizon.net,,4/4/2007,$100.00,135,208,0
2981023,,,,Bret,Ladine,,"128 Ivy Drive, Apt. 3",,,Charlottesville,VA,22903,,,N/A,Law student,,,,,bret.ladine@gmail.com,,4/25/2007,$25.00,135,208,0
3130524,Mr.,,,Brett,Johnson,,1017 S.  Cypress Ave,,,Broken Arrow,OK,74012,,,Optronics Products Group,Vice President - Sales/Marketing,,,,,brettannetteok@cox.net,918-605-9538,4/24/2007,$50.00,135,208,0
2465743,Mrs.,,,Bridget,Kimball,,2205 Agnes Road,,,Manhattan Beach,CA,90266,,,None,Retired,,,,,BDKIMBALL@AOL.COM,,4/11/2007,$50.00,135,208,0
1290963,Dr.,,,Bruce,Donehower,,7217 Cardinal Road,,,Fair Oaks,CA,95628,,,U of CA,Professor,,,,,bdonehower@yahoo.com,,4/25/2007,$25.00,135,208,0
3109753,Mr.,,,Camanmue,Holgirpaly,,95 Smith Street,Apt-C,,North Attleboro,MA,02760,,,DMR,social worker,,,,,canmue@yahoo.com,508-643-0594,4/5/2007,$35.00,135,208,0
1529169,Mr.,,,Carl,Armstrong,,2415 W. Tucana St.,,,Tucson,AZ,857453306,,,Retired,Lt.Col USAF Retired,,,,,candja@cox.net,520-792-2151,4/10/2007,$25.00,135,208,0
29625,Mr.,,,Carl,Fischer,,4840 Thunderbird Drive,Apt 193,,Boulder,CO,80303,,,retired,retired,,,,,billfischer193@comcast.net,720-562-8170,4/10/2007,$35.00,135,208,0
53898,Dr.,,,Carol,Evans,,413 E. Washington Ave.,,,Guthrie,OK,73044,,,Langston University,Teacher,,,,,caevans613@msn.com,405-260-6241,4/2/2007,$50.00,135,208,0
1531042,Mrs.,,,Carol,Days,,472 Holly Ave,,,Brewster,MA,02631,,,retired,retired,,,,,cdays@verizon.net,,4/1/2007,$50.00,135,208,0
446615,Dr.,,,Carol,Hansen,,518 Entrada Dr. 201,,,Novato,CA,94949,,,City College of San Francisco,English Instructor,,,,,CARHANSEN@SBCGLOBAL.NET,415-883-8365,4/1/2007,$25.00,135,208,0
325139,,,,Carola,Sprague,,44 Oakdale Court,,,Clearfield,KY,40313,,,retired,retired,,,,,carola.sprague@gmail.com,606-784-7416,4/25/2007,$10.00,135,208,0
309684,Mrs.,,,Carole,Straughn,,834 NW 18th Street,,,Oklahoma City,OK,73106,,,Dianon/Labcorp OKC,Cytotechnologist,,,,,CAROLEFS@SBCGLOBAL.NET,405-524-4107,4/1/2007,$50.00,135,208,0
28580,Ms.,,,Carolyn S.,Levin,,180 E. Pearson St. # 5107,,,Chicago,IL,60611,,,Retired,Retired,,,,,clevin1@sbcglobal.net,,4/23/2007,$500.00,135,208,0
15821,Mr.,,,Casey,Scott,,"2700 Vista Grande Dr. NW, #93",,,Albuquerque,NM,87120,,,Retired,Retired,,,,,operacase@aol.com,,4/13/2007,$50.00,135,208,0
3126238,Ms.,,,Catherine,Cooley,,838 Maple Street,,,Edmonds,WA,98020,,,First Horizon Home Loan Corp.,Account Executive,,,,,catcooley@comcast.net,,4/19/2007,$50.00,135,208,0
3121783,Ms.,,,Charlene,Ahern,,15340 Albright Street #306,,,Pacific Palisades,CA,90272,,,Brenda Himmel Stationery,Retail sales,,,,,csahern@verizon.net,,4/18/2007,$100.00,135,208,0
3125238,Dr.,,,Charles,Simons,,257 27th Avwe,,,San Francisco,CA,94121,,,City of San Francisco,Epidemiologist,,,,,jcs_47@yahoo.com,,4/19/2007,$50.00,135,208,0
3109633,Mr.,,,Charles,Kent,,722 N. Overlook Drive,,,Alexandria,VA,22305,,,EPA,Government,,,,,chuckent@comcast.net,703-548-7488,4/3/2007,$50.00,135,208,0
1434742,Mr.,,,Charles,Schultz,,16662 Haskins Road,,,Bowling Green,OH,434029311,,,retirred,retired,,,,,peanuts@dacor.net,,4/24/2007,$35.00,135,208,0
2955814,Mr.,,,Chris,Sinton,,20 Santa Rita Ave,,,San Francisco,CA,94116,,,none,none,,,,,regsinton@sbcglobal.net,415-731-4445,4/25/2007,$50.00,135,208,0
3139895,,,,Chris,Briggs,,PO box 372,,,Geneva,IN,46740,,,,,,,,,wooff69@icqmail.com,,4/4/2007,$50.00,135,208,0
2533209,,,,Christopher,Egan,,4926 Camden Avenue North,,,Minneapolis,MN,55430,,,self,Consultant,,,,,kitegan@msn.com,,4/25/2007,$50.00,135,208,0
3131768,,,,Clare,Goodman,,7 Royal Oak Court,,,Potomac,MD,20854,,,"""Retired""","""Retired""",,,,,kgoodman40@comcast.net,,4/28/2007,$18.00,135,208,0
2954808,Mr.,,,Clarence,Brown,,456-B Lombard Rd,,,Rising Sun,MD,21911,,,n/a,self-employed,,,,,klarwin@zoominternet.net,410-658-5520,4/12/2007,$20.00,135,208,0
2103273,Mr.,,,Clay,Hester,,124 Woods Rd,,,Newport News,VA,23601,,,Retired,Retired,,,,,CHESTER7@COX.NET,,4/12/2007,$50.00,135,208,0
1538517,Mr.,,,Cletus,May,,309 SE Ironwood Avenue,,,Dallas,OR,97338,,,retired,retired,,,,,crmay@surfbest.net,,4/1/2007,$50.00,135,208,0
2949368,Mr.,,,Clyde,Snyder,,18 Foxglove Drive,,,Greensburg,PA,15601,,,Tetra Tech NUS,Training Specialist,,,,,Clyde.Snyder@ttnus.com,,4/5/2007,$25.00,135,208,0
8078,Ms.,,,Connie,Razmus,,12844 NW Huckleberry Ln,PO Box 145,,Seal Rock,OR,97376,,,retired,retired,,,,,2dot@peak.org,541-563-3754,4/10/2007,$20.01,135,208,0
8078,Ms.,,,Connie,Razmus,,12844 NW Huckleberry Ln,PO Box 145,,Seal Rock,OR,97376,,,retired,retired,,,,,2dot@peak.org,541-563-3754,4/10/2007,$20.01,135,208,0
1300951,Mrs.,,,Constance,Brons,,2631 Fallbrook Dr.,,,Merced,CA,95340,,,self,psychotherapist,,,,,conniebrons@yahoo.com,,4/4/2007,$25.00,135,208,0
3113616,Ms.,,,Constance,White,,"1763 N. Sedgwick St., 1N",,,Chicago,IL,60614,,,school of the art institute of chicago,educator/ graphic designer,,,,,conniefw@aol.com,,4/10/2007,$35.00,135,208,0
2940415,,,,Corin,Solarin,,35610 Paseo Circulo E,,,Cathedral City,CA,922347165,,,State of California,Teacher,,,,,csolarin@hotmail.com,951-205-1183,4/3/2007,$25.00,135,208,0
2965011,Ms.,,,Corrine,Kucirka,,1214 Highland Drive,,,Orefield,PA,18069,,,N/A,Homemaker,,,,,CKUCIRKA@YAHOO.COM,610-530-7838,4/25/2007,$10.00,135,208,0
91490,,,,Curtis,Kueker,,"175 Pfeiffer St., #2",,,San Francisco,CA,94133,,,Self,Software Engineer,,,,,curtiskueker@yahoo.com,,4/20/2007,$60.00,135,208,0
18196,,,,Curtis,Hitt,,8707 Ridgehill Dr.,,,Austin,TX,78759,,,The Urology Team,Physician,,,,,chitt@austin.rr.com,512-345-6457,4/10/2007,$35.00,135,208,0
3109571,Ms.,,,Cydney,Ross,,6836 N 13th Place,,,Phoenix,AZ,85014,,,Kolbe Corp,Operations,,,,,catmom16@cox.net,602-265-0403,4/1/2007,$50.00,135,208,0
2951319,Mr.,,,Dale,Schafer,,5155 N High st,,,Columbus,OH,43214,,,self,retired attorney,,,,,DALECSCHAFER@AOL.COM,614-842-8065,4/1/2007,$25.00,135,208,0
3099222,Mr.,,,Dale,Frankis,,P O Box 130,,,Bountiful,UT,84011,,,N/A,Lawyer,,,,,DSIKNARF@YAHOO.COM,,4/24/2007,$100.00,135,208,0
3134867,Mr.,,,Damon,Myers,,444 NE 30TH ST UNIT 505,,,MIAMI,FL,33137,,,mandarin oriental hotel,hospitality,,,,,damonmyers@usa.net,305-588-4412,4/30/2007,$40.00,135,208,0
3109807,Mr.,,,Daniel,Nixon,,5950 SW Balsam Drive,,,Corvallis,OR,97333,,,Hewlett Packard,Manager,,,,,dan_nixon@yahoo.com,,4/7/2007,$100.00,135,208,0
38885,Mr.,,,Daniel,Levin,,2751 Motor Avenue,,,Los Angeles,CA,90064,,,self,"director, theater & film",,,,,Peterdan@sbcglobal.net,,4/19/2007,$250.00,135,208,0
2638485,,,,Daniel,Hofer,,382 Fallingstar,,,Irvine,CA,92614,,,self-employed,CPA,,,,,dhofer@pacbell.net,949-733-9517,4/7/2007,$50.00,135,208,0
3109807,Mr.,,,Daniel,Nixon,,5950 SW Balsam Drive,,,Corvallis,OR,97333,,,Hewlett Packard,Manager,,,,,dan_nixon@yahoo.com,,4/7/2007,$100.00,135,208,0
1956805,,,,Daniel,Schlenger,,217 Augusta Ln,,,Aptos,CA,95003,,,Self,Chiropractor,,,,,orders51@yahoo.com,,4/5/2007,$35.00,135,208,0
2641757,Mr.,,,Daniel A.,Pierro,,4 Virginia Circle,,,Ridley Park,PA,19078,,,"Paul Cannataro, CPA",CPA,,,,,dpierro@rcn.com,610-534-9662,4/7/2007,$27.00,135,208,0
2641757,Mr.,,,Daniel A.,Pierro,,4 Virginia Circle,,,Ridley Park,PA,19078,,,"Paul Cannataro, CPA",CPA,,,,,dpierro@rcn.com,610-534-9662,4/7/2007,$27.00,135,208,0
2641757,Mr.,,,Daniel A.,Pierro,,4 Virginia Circle,,,Ridley Park,PA,19078,,,"Paul Cannataro, CPA",CPA,,,,,dpierro@rcn.com,610-534-9662,4/7/2007,$27.00,135,208,0
3109751,Mr.,,,Dave,Adamson,,4416 W. 26th Place,,,Joplin,MO,64804,,,St. John's Regional Medical Center,RN,,,,,da0509@sbcglobal.net,417-626-2003,4/5/2007,$55.00,135,208,0
3130632,Mr.,,,David,Keys,,1282 Starboard Key,,,Tarpon Springs,FL,34689,,,Federal Government,environmental policy coordinator,,,,,davidkeys8@aol.com,,4/24/2007,$25.00,135,208,0
2158238,Mr.,,,David,Jefferson,,2329 Parnell Avenue,,,Los Angeles,CA,90064,,,Montage,real estate,,,,,cosmicdavej@Hotmail.com,,4/24/2007,$25.00,135,208,0
2704526,Mr.,,,David,Gifford,,23 Fiddler's Way,,,Lafayette,NJ,07848,,,Milliken & Company,Sales Rep,,,,,dcgifford@earthlink.net,973-300-1750,4/13/2007,$50.00,135,208,0
3114665,,,,David,Keast,,657 Westford St.,,,Carlisle,MA,01741,,,retired,retired,,,,,dnkeast@comcast.net,,4/10/2007,$50.00,135,208,0
725367,,,,David,Wilson,,91 Capen St,,,Medford,MA,021554302,,,Amtrak,track worker,,,,,DJWIL@COMCAST.NET,,4/26/2007,$50.00,135,208,0
3131835,,,,David,Wilson Barnes,,754 Greenwich St.,#3B,,New York,NY,10014,,,N/A,Actor,,,,,thither55@hotmail.com,212-989-2815,4/29/2007,$35.00,135,208,0
3121067,Dr.,,,David,Lilien,,648 Wilder Place,,,Shreveport,LA,71104,,,Biomed Research Foundation,physician,,,,,dlilien@bellsouth.net,318-868-0795,4/14/2007,$100.00,135,208,0
42322,,,,David,Nordstrom,,1112 English Oak,,,Loveland,CO,80538,,,Self,Dentist,,,,,davenord@hotmail.com,,4/13/2007,$50.00,135,208,0
5514,Mr.,,,David,Berkshire,,9713 Mariposa,,,Houston,TX,770254516,,,retired,retired chemist,,,,,dacbe@earthlink.net,,4/24/2007,$50.00,135,208,0
3129711,Mr.,,,David,Roberts,,81 Coalpit Hill Road,Unit G,,Danbury,CT,06810,,,Retired,Retired,,,,,daveroberts44@comcast.net,203-798-6938,4/21/2007,$35.00,135,208,0
1764799,Mr.,,,David,Bessire,,2796 Auburn Blvd,,,Port Charlotte,FL,33948,,,Florida Education Association,Consultant,,,,,dwbessire@yahoo.com,941-625-3142,4/25/2007,$100.00,135,208,0
106666,Mr.,,,Dean,Surkin,,311 BRONXVILLE RD,,,Bronxville,NY,107082111,,,Rosen Seymour Shapss Martin & Co. LLP,attorney,,,,,DSURKIN@OPTONLINE.NET,914-961-6953,4/4/2007,$25.00,135,208,0
3126800,Ms.,,,Debora,Stein,,10750 Wilshire Blvd.,#903,,Los Angeles,CA,90024,,,Retired,Retired,,,,,DMHSS@aol.com,,4/19/2007,$25.00,135,208,0
1752380,,,,Deborah,Oberg,,206 West Kelsey Street,,,Bloominton,IL,61701,,,Human Service Center,Manager,,,,,dkoberg@aol.com,,4/10/2007,$25.00,135,208,0
3130506,Mrs.,,,Denise,Benacquisto,,28760 WALES DR,,,CHESTERFIELD,MI,480471742,,,SELF-EMPLOYED,TAX PREPARER,,,,,farside@comcast.net,,4/24/2007,$50.00,135,208,0
2116417,Mr.,,,Dennis,Barberi,,1576 eason,,,waterford,MI,48328,,,general dynamics,engineer,,,,,DLBARBERI_98@YAHOO.COM,,4/1/2007,$50.00,135,208,0
32279,Professor,,,Devere,Pentony,,26 Serrano Drive,,,San Francisco,CA,94132,,,retired,retired,,,,,dpentony@sfsu.edu,415-469-5324,4/6/2007,$25.00,135,208,0
3130678,Ms.,,,Diane,woodward frost,,7441 south winston ave,,,tulsa,OK,74136,,,retired,retired,,,,,woodphillips@cox.net,918-494-9946,4/24/2007,$40.00,135,208,0
3120276,,,,Don,Castles,,9 West Southwood Drive,,,Woodland,CA,95695,,,Yolo-Solano AQMD,Air Monitoring Technician,,,,,decastles@sbcglobal.net,530-662-1564,4/13/2007,$20.00,135,208,0
3129766,,,,Don,Lepley,,1512 Cornell Street,,,Susanville,CA,96130,,,US Forest Service,botanist,,,,,delepley@hotmail.com,,4/22/2007,$25.00,135,208,0
3113816,Mr.,,,Donald,O'kelley,,615 Woodland Drive,,,Benton,AR,72019,,,Retired,Retired,,,,,donaldokelley@bcglobal.net,,4/10/2007,$50.00,135,208,0
281794,Mr.,,,Donald,Stein,,18 Pine Mountain Circle,,,Barkhamsted,CT,060631142,,,self-employed,consultant,,,,,dsslss@charter.net,,4/2/2007,$50.00,135,208,0
2949121,Mr.,,,Donald,Deane,,2062 Oak Ave.,,,Boulder,CO,80304,,,self,HR consultant,,,,,d.deane@comcast.net,,4/11/2007,$500.00,135,208,0
1536347,,,,Donald,Vanderkolk,,238 Skyline Drive,,,Coram,NY,11727,,,retired,retired,,,,,dvanderk@suffolk.lib.ny.us,,4/1/2007,$9.00,135,208,0
267385,Mr.,,,Donald,Grove,,4402 South 3080 East,,,Salt Lake City,UT,84124,,,HK Systems,Principal Software Engineer,,,,,DCGROVE57@hotmail.com,801-274-5214,4/25/2007,$35.00,135,208,0
2486701,,,,Donald,Morrow,,130 School St,,,Washingtonville,OH,444909725,,,retired,retired,,,,,DLMSERVICE@AOL.COM,330-427-2166,4/11/2007,$25.00,135,208,0
287788,,,,Donald,Anderson,,1250 S. Race Street,,,Denver,CO,80210,,,US Fish & Wildlife Service,Hydrologist,,,,,dma1guy@aol.com,,4/26/2007,$25.00,135,208,0
19914,,,,Donald,Mccoy,,821 SE 12th Court,,,Fort Lauderdale,FL,33316,,,Self-employed,Lawyer,,,,,donaldmccoy@bellsouth.net,,4/10/2007,$10.00,135,208,0
1562939,Ms.,,,Donna,de palma,,4650 driftwood court,,,el sobrante,CA,94803,,,alta bates summit medical center,registered nurse,,,,,donna1126@comcast.net,,4/13/2007,$35.00,135,208,0
1755205,Mrs.,,,Doreen,Moore,,1134 S. Eucalyptus,,,Inglewood,CA,903013715,,,Axminster Medical Group,nurse case manager,,,,,doakimo@aol.com,310-672-9047,4/1/2007,$25.00,135,208,0
86272,Mrs.,,,Dorothy,Mcaden,,326 W. El Freda Road,,,Tempe,AZ,852845267,,,Arizona State University,"Human Resources Specialist, Sr.",,,,,dotmcaden@hotmail.com,,4/25/2007,$35.00,135,208,0
7053,Mrs.,,,Dorothy,Blaustein,,261 Random Road,,,Fairfield,CT,06825,,,none,none,,,,,activdot@optonline.net,,4/19/2007,$25.00,135,208,0
314324,Mr.,,,Douglas,Mallory,,115 Hamlet Road,,,Levittown,NY,11756,,,Loehmann's,Technical specialist,,,,,DOUGLMLLRY@AOL.COM,,4/26/2007,$25.00,135,208,0
1541166,,,,Douglas,Julius,,1118 North Payne Street,,,New Ulm,MN,56073,,,Chuck Spaeth Ford,Sales,,,,,douglasdjulius@yahoo.com,507-359-4688,4/1/2007,$35.00,135,208,0
68468,,,,Douglas,Dransfield,,48 Richmond Terrace,,,Cape Elizabeth,ME,041079530,,,retired,retired,,,,,ddransf1@maine.rr.com,207-767-4177,4/23/2007,$35.00,135,208,0
3119959,,,,Duane,Florschuetz,,194 Whispering Wind,,,Georgetown,TX,78628,,,Retired,Retired,,,,,dflorschuetz@yahoo.com,512-868-2621,4/13/2007,$25.00,135,208,0
2100159,Mr.,,,E  Anthony,Cirillo,,11526 Piping Rock,,,Houston,TX,77077,,,Gillman Comapnies,Chief Internal Auditor,,,,,CIRANT@HAL-PC.ORG,281-496-4245,4/1/2007,$35.00,135,208,0
2137697,Mr.,,,Edgar,Pinto,,1318 W Argyle,,,Chicago,IL,60640,,,retired,retired,,,,,edgarpinto@ameritech.net,,4/11/2007,$40.00,135,208,0
303375,,,,Edna D.,Salyer,,287 A West High Street,,,Mount Gilead,OH,43338,,,Retired,Retired Teacher,,,,,EDDIEREDDIE11@EARTHLINK.NET,419-946-3669,4/10/2007,$100.00,135,208,0
2535908,Mr.,,,Edward,Park,,2930 Folts Circle,,,Chattanooga,TN,37415,,,self,consultant,,,,,eparkseven@yahoo.com,,4/25/2007,$15.00,135,208,0
36809,Mr.,,,Edward,Hunt,,945 FENWOOD DRIVE,,,VALLEY STREAM,NY,11580,,,NONE,RETIRED,,,,,EHUNTV@AOL.COM,,4/25/2007,$25.00,135,208,0
3114676,Mr.,,,Edwin,Cassidy,,53 Harding Ave,,,Weymouth,MA,02188,,,retired,retired,,,,,ed.edc@verizon.net,,4/10/2007,$25.00,135,208,0
2938355,Dr.,,,Eion,Scott,,598 NE Lenox St,,,Hillsboro,OR,97124,,,none,retired,,,,,eions@mac.com,503-648-9165,4/10/2007,$35.00,135,208,0
2130635,Ms.,,,Elaine,Raynak,,4421 S. Section Line Road,,,Delaware,OH,43015,,,Boehring-ingelheim,sales representative,,,,,ELAINERAYNAK@AOL.COM,740-881-4479,4/9/2007,$35.00,135,208,0
3121209,Mrs.,,,Elaine,Bennett,,943  6th Place S.E.,,,Mason City,IA,504015261,,,Retired educator,Retired educator,,,,,jebnett@netconx.net,641-424-4708,4/15/2007,$15.00,135,208,0
3109568,Ms.,,,Elizabeth,Oliver,,1503 Mildred Ave,,,Bellevue,NE,68005,,,Sarpy County Sheriff's Office,Law enforcement,,,,,liltiger825@yahoo.com,,4/1/2007,$35.00,135,208,0
1532745,,,,Ella R.,Delassus,,3935 Weber Road,,,St. Louis,MO,631237750,,,retired,retired,,,,,bekind@sbcglobal.net,,4/4/2007,$25.00,135,208,0
245743,Ms.,,,Ellie,Murphy,,5935 North 83rd Street,,,Scottsdale,AZ,852506214,,,Retired,Retired,,,,,elliemur@cox.net,480-991-0740,4/25/2007,$25.00,135,208,0
2551299,Ms.,,,Emily,Tanner,,671 Gardern Circle,,,Statham,GA,30666,,,self,counselor,,,,,EMILYTANNER2@YAHOO.COM,,4/2/2007,$25.00,135,208,0